Target
Sodium-dependent dopamine transporter
Ligand
BDBM50049936
Substrate
Meas. Tech.
ChEMBL_1456597 (CHEMBL3369979)
IC50
130±n/a nM
Citation
 Honda, EIshichi, YKimura, EYoshikawa, MKanzaki, NNakagawa, HTerao, YSuzuki, AKawai, TArakawa, YOhta, HTerauchi, J Design, synthesis, and biological activities of 1-aryl-1,4-diazepan-2-one derivatives as novel triple reuptake inhibitors. Bioorg Med Chem Lett 24:3898-902 (2014)  
Target
Name:
Sodium-dependent dopamine transporter
Synonyms:
DA transporter DAT1 Dopamine transporter protein (DAT) SC6A3_HUMAN Sodium-dependent dopamine transporter Solute carrier family 6 member 3
Type:
Multi-pass membrane protein
Mol. Mass.:
68497.11
Organism:
Homo sapiens (Human)
Description:
Q01959
Residue:
620
  
Inhibitor
Name:
BDBM50049936
Synonyms:
CHEMBL3317703
Type:
Small organic molecule
Emp. Form.:
C17H21ClN2O
Mol. Mass.:
304.814
SMILES:
Cl.CCC1NCCCN(c2ccc3ccccc3c2)C1=O
: