Target
Nuclear receptor ROR-alpha
Ligand
BDBM50050083
Substrate
Meas. Tech.
ChEMBL_1457465 (CHEMBL3367605)
EC50
>10000±n/a nM
Citation
 Fauber, BPRené, Ode Leon Boenig, GBurton, BDeng, YEidenschenk, CEverett, CGobbi, AHymowitz, SGJohnson, ARLa, HLiimatta, MLockey, PNorman, MOuyang, WWang, WWong, H Reduction in lipophilicity improved the solubility, plasma-protein binding, and permeability of tertiary sulfonamide RORc inverse agonists. Bioorg Med Chem Lett 24:3891-7 (2014)  
Target
Name:
Nuclear receptor ROR-alpha
Synonyms:
NR1F1 Nuclear receptor subfamily 1 group F member 1 RORA RZRA | Retinoid-related orphan receptor-alpha
Type:
PROTEIN
Mol. Mass.:
58976.26
Organism:
Homo sapiens (Human)
Description:
ChEMBL_101591
Residue:
523
  
Inhibitor
Name:
BDBM50050083
Synonyms:
CHEMBL3317833 | US9216988, 101
Type:
Small organic molecule
Emp. Form.:
C24H33N3O3S
Mol. Mass.:
443.602
SMILES:
CC(C)CN(Cc1ccc(cc1)N1CCN(CC1)C(C)=O)S(=O)(=O)Cc1ccccc1
: