Target
Nuclear receptor ROR-alpha
Ligand
BDBM50050086
Substrate
Meas. Tech.
ChEMBL_1457465 (CHEMBL3367605)
EC50
>10000±n/a nM
Citation
 Fauber, BPRené, Ode Leon Boenig, GBurton, BDeng, YEidenschenk, CEverett, CGobbi, AHymowitz, SGJohnson, ARLa, HLiimatta, MLockey, PNorman, MOuyang, WWang, WWong, H Reduction in lipophilicity improved the solubility, plasma-protein binding, and permeability of tertiary sulfonamide RORc inverse agonists. Bioorg Med Chem Lett 24:3891-7 (2014)  
Target
Name:
Nuclear receptor ROR-alpha
Synonyms:
NR1F1 Nuclear receptor subfamily 1 group F member 1 RORA RZRA | Retinoid-related orphan receptor-alpha
Type:
PROTEIN
Mol. Mass.:
58976.26
Organism:
Homo sapiens (Human)
Description:
ChEMBL_101591
Residue:
523
  
Inhibitor
Name:
BDBM50050086
Synonyms:
CHEMBL3317836 | US9216988, 55
Type:
Small organic molecule
Emp. Form.:
C24H31N3O3S
Mol. Mass.:
441.586
SMILES:
CC(=O)N1CCN(CC1)c1ccc(CN(C2CCC2)S(=O)(=O)Cc2ccccc2)cc1
: