Target
Potassium channel subfamily K member 9
Ligand
BDBM50050457
Substrate
Meas. Tech.
ChEMBL_1457494 (CHEMBL3367861)
IC50
>30000±n/a nM
Citation
 Flaherty, DPSimpson, DSMiller, MMaki, BEZou, BShi, JWu, MMcManus, OBAubé, JLi, MGolden, JE Potent and selective inhibitors of the TASK-1 potassium channel through chemical optimization of a bis-amide scaffold. Bioorg Med Chem Lett 24:3968-73 (2014)  
Target
Name:
Potassium channel subfamily K member 9
Synonyms:
Acid-sensitive potassium channel protein TASK-3 KCNK9_HUMAN TWIK-related acid-sensitive K(+) channel 3 Two pore potassium channel KT3.2
Type:
PROTEIN
Mol. Mass.:
42276.04
Organism:
Homo sapiens (Human)
Description:
ChEMBL_1457494
Residue:
374
  
Inhibitor
Name:
BDBM50050457
Synonyms:
CHEMBL3188245
Type:
Small organic molecule
Emp. Form.:
C19H15N3O2
Mol. Mass.:
317.3413
SMILES:
O=C(Nc1cccc(NC(=O)c2ccncc2)c1)c1ccccc1
: