Target
Potassium channel subfamily K member 3
Ligand
BDBM50050504
Substrate
Meas. Tech.
ChEMBL_1457501 (CHEMBL3367868)
IC50
60±n/a nM
Citation
 Flaherty, DPSimpson, DSMiller, MMaki, BEZou, BShi, JWu, MMcManus, OBAubé, JLi, MGolden, JE Potent and selective inhibitors of the TASK-1 potassium channel through chemical optimization of a bis-amide scaffold. Bioorg Med Chem Lett 24:3968-73 (2014)  
Target
Name:
Potassium channel subfamily K member 3
Synonyms:
Acid-sensitive potassium channel TASK-1 KCNK3 Potassium channel protein TASK-1 Potassium channel subfamily K member 3 (TASK-1) TASK1 Two pore K(+) channel KT3.1 | Two pore potassium channel KT3.1
Type:
Protein
Mol. Mass.:
43534.71
Organism:
Homo sapiens (Human)
Description:
O14649
Residue:
394
  
Inhibitor
Name:
BDBM50050504
Synonyms:
CHEMBL3182725
Type:
Small organic molecule
Emp. Form.:
C22H17F3N2O3
Mol. Mass.:
414.3772
SMILES:
Cc1cccc(c1)C(=O)Nc1cccc(NC(=O)c2ccccc2OC(F)(F)F)c1
: