Target
Sodium- and chloride-dependent GABA transporter 2
Ligand
BDBM50051038
Substrate
Meas. Tech.
ChEMBL_1460089 (CHEMBL3368849)
IC50
19498±n/a nM
Citation
 Quandt, GHöfner, GPabel, JDine, JEder, MWanner, KT First photoswitchable neurotransmitter transporter inhibitor: light-induced control of¿-aminobutyric acid transporter 1 (GAT1) activity in mouse brain. J Med Chem 57:6809-21 (2014)  
Target
Name:
Sodium- and chloride-dependent GABA transporter 2
Synonyms:
GABA transporter Gabt2 Gat-3 Gat3 Slc6a13
Type:
PROTEIN
Mol. Mass.:
68283.40
Organism:
Mus musculus
Description:
ChEMBL_1460089
Residue:
602
  
Inhibitor
Name:
BDBM50051038
Synonyms:
CHEMBL3318047
Type:
Small organic molecule
Emp. Form.:
C26H29N3O3
Mol. Mass.:
431.5268
SMILES:
OC(=O)[C@@H]1CCCN(CCOCCc2ccc(cc2)\N=N\c2cccc3ccccc23)C1
: