Target
Carbonic anhydrase 2
Ligand
BDBM50206509
Substrate
Meas. Tech.
ChEMBL_1448691 (CHEMBL3372049)
Ki
431±n/a nM
Citation
 D'Ascenzio, MCarradori, SSecci, DVullo, DCeruso, MAkdemir, ASupuran, CT Selective inhibition of human carbonic anhydrases by novel amide derivatives of probenecid: synthesis, biological evaluation and molecular modelling studies. Bioorg Med Chem 22:3982-8 (2014)  
Target
Name:
Carbonic anhydrase 2
Synonyms:
CA-II CAC Carbonate dehydratase II Carbonic anhydrase 2 (CA-II) Carbonic anhydrase C Carbonic anhydrase II (CA-II) Carbonic anhydrase II (hCA II) | Carbonic anhydrase isoenzyme II (hCA II)
Type:
Enzyme
Mol. Mass.:
29250.71
Organism:
Homo sapiens (Human)
Description:
P00918
Residue:
260
  
Inhibitor
Name:
BDBM50206509
Synonyms:
4-Dipropylsulfamoyl-benzoic acid 4-Dipropylsulfamoyl-benzoic acid(probenecid) CHEMBL897 Probalan
Type:
Small organic molecule
Emp. Form.:
C13H19NO4S
Mol. Mass.:
285.359
SMILES:
CCCN(CCC)S(=O)(=O)c1ccc(cc1)C(O)=O
: