Target
Aurora kinase B
Ligand
BDBM50051964
Substrate
Meas. Tech.
ChEMBL_1453020 (CHEMBL3362102)
IC50
347±n/a nM
Citation
 Wang, HCJagtap, ADChang, PTLiu, JRLiu, CPTseng, HWChen, GSChern, JW Bioisosteric replacement of an acylureido moiety attached to an indolin-2-one scaffold with a malonamido or a 2/4-pyridinoylamido moiety produces a selectively potent Aurora-B inhibitor. Eur J Med Chem 84:312-34 (2014)  
Target
Name:
Aurora kinase B
Synonyms:
AIK2 AIM1 ARK2 AURKB_HUMAN Aurora B-INCENP Aurora kinase B (AURKB) STK-1 STK12 Serine/threonine-protein kinase aurora B
Type:
Protein
Mol. Mass.:
39327.72
Organism:
Homo sapiens (Human)
Description:
Q96GD4
Residue:
344
  
Inhibitor
Name:
BDBM50051964
Synonyms:
CHEMBL3322568
Type:
Small organic molecule
Emp. Form.:
C25H22N4O4
Mol. Mass.:
442.4666
SMILES:
COc1ccc(NC(=O)C2(CC2)C(=O)Nc2ccc3\C(=C\c4ccc[nH]4)C(=O)Nc3c2)cc1
: