Target
Cytochrome P450 2D6
Ligand
BDBM50052249
Substrate
Meas. Tech.
ChEMBL_1456621 (CHEMBL3370221)
IC50
>5000±n/a nM
Citation
 Dragovich, PSFauber, BPBoggs, JChen, JCorson, LBDing, CZEigenbrot, CGe, HGiannetti, AMHunsaker, TLabadie, SLi, CLiu, YLiu, YMa, SMalek, SPeterson, DPitts, KEPurkey, HERobarge, KSalphati, LSideris, SUltsch, MVanderPorten, EWang, JWei, BXu, QYen, IYue, QZhang, HZhang, XZhou, A Identification of substituted 3-hydroxy-2-mercaptocyclohex-2-enones as potent inhibitors of human lactate dehydrogenase. Bioorg Med Chem Lett 24:3764-71 (2014)  
Target
Name:
Cytochrome P450 2D6
Synonyms:
CP2D6_HUMAN CYP2DL1 Cytochrome P450 2D6 (CYP2D6) P450-DB1
Type:
Protein
Mol. Mass.:
55774.82
Organism:
Homo sapiens (Human)
Description:
P10635
Residue:
497
  
Inhibitor
Name:
BDBM50052249
Synonyms:
CHEMBL3318423
Type:
Small organic molecule
Emp. Form.:
C19H15NO2S
Mol. Mass.:
321.393
SMILES:
OC1=C(Sc2ccccc2C#N)C(=O)CC(C1)c1ccccc1
: