Target
Aurora kinase B
Ligand
BDBM50053269
Substrate
Meas. Tech.
ChEMBL_1458485 (CHEMBL3370371)
IC50
31900±n/a nM
Citation
 Song, DPark, YYoon, JAman, WHah, JMRyu, JS Click approach to the discovery of 1,2,3-triazolylsalicylamides as potent Aurora kinase inhibitors. Bioorg Med Chem 22:4855-66 (2014)  
Target
Name:
Aurora kinase B
Synonyms:
AIK2 AIM1 ARK2 AURKB_HUMAN Aurora B-INCENP Aurora kinase B (AURKB) STK-1 STK12 Serine/threonine-protein kinase aurora B
Type:
Protein
Mol. Mass.:
39327.72
Organism:
Homo sapiens (Human)
Description:
Q96GD4
Residue:
344
  
Inhibitor
Name:
BDBM50053269
Synonyms:
CHEMBL3323022
Type:
Small organic molecule
Emp. Form.:
C24H18ClF3N4O4
Mol. Mass.:
518.872
SMILES:
COc1cc(OC)c(cc1Cl)-c1cn(nn1)-c1ccc(O)c(c1)C(=O)Nc1cccc(c1)C(F)(F)F
: