Target
Dual specificity protein kinase TTK
Ligand
BDBM50053373
Substrate
Meas. Tech.
ChEMBL_1458488 (CHEMBL3370374)
IC50
15±n/a nM
Citation
 Laufer, RNg, GLiu, YPatel, NKEdwards, LGLang, YLi, SWFeher, MAwrey, DELeung, GBeletskaya, IPlotnikova, OMason, JMHodgson, RWei, XMao, GLuo, XHuang, PGreen, EKiarash, RLin, DCHarris-Brandts, MBan, FNadeem, VMak, TWPan, GJQiu, WChirgadze, NYPauls, HW Discovery of inhibitors of the mitotic kinase TTK based on N-(3-(3-sulfamoylphenyl)-1H-indazol-5-yl)-acetamides and carboxamides. Bioorg Med Chem 22:4968-97 (2014)  
Target
Name:
Dual specificity protein kinase TTK
Synonyms:
Dual specificity protein kinase (TTK) MPS1 Monopolar Spindle 1 (MPS1) Monopolar Spindle 1 Kinase (MPS1) TTK | TTK_HUMAN
Type:
Protein
Mol. Mass.:
97086.79
Organism:
Homo sapiens (Human)
Description:
P33981
Residue:
857
  
Inhibitor
Name:
BDBM50053373
Synonyms:
CHEMBL3330406
Type:
Small organic molecule
Emp. Form.:
C23H23N5O3S
Mol. Mass.:
449.525
SMILES:
CN(C)[C@@H](C(=O)Nc1ccc2[nH]nc(-c3cccc(c3)S(N)(=O)=O)c2c1)c1ccccc1
: