Target
Acetylcholinesterase
Ligand
BDBM50053431
Substrate
Meas. Tech.
ChEMBL_1460146 (CHEMBL3369131)
IC50
16±n/a nM
Citation
 Darras, FHWehle, SHuang, GSotriffer, CADecker, M Amine substitution of quinazolinones leads to selective nanomolar AChE inhibitors with 'inverted' binding mode. Bioorg Med Chem 22:4867-81 (2014)  
Target
Name:
Acetylcholinesterase
Synonyms:
ACES_ELEEL Acetylcholinesterase (EeAChE) | ache
Type:
Enzyme
Mol. Mass.:
71812.79
Organism:
Electrophorus electricus (Electric eel)
Description:
Residue:
633
  
Inhibitor
Name:
BDBM50053431
Synonyms:
CHEMBL3323038
Type:
Small organic molecule
Emp. Form.:
C22H23N3O2
Mol. Mass.:
361.4369
SMILES:
O=c1n2Cc3ccccc3-c2nc2ccc(OCCCN3CCCC3)cc12
: