Target
Acetylcholinesterase
Ligand
BDBM50053453
Substrate
Meas. Tech.
ChEMBL_1460146 (CHEMBL3369131)
IC50
39±n/a nM
Citation
 Darras, FHWehle, SHuang, GSotriffer, CADecker, M Amine substitution of quinazolinones leads to selective nanomolar AChE inhibitors with 'inverted' binding mode. Bioorg Med Chem 22:4867-81 (2014)  
Target
Name:
Acetylcholinesterase
Synonyms:
ACES_ELEEL Acetylcholinesterase (EeAChE) | ache
Type:
Enzyme
Mol. Mass.:
71812.79
Organism:
Electrophorus electricus (Electric eel)
Description:
Residue:
633
  
Inhibitor
Name:
BDBM50053453
Synonyms:
CHEMBL3323066
Type:
Small organic molecule
Emp. Form.:
C22H31N3O2
Mol. Mass.:
369.5004
SMILES:
O=c1n2CCCCCc2nc2ccc(OCCCN3CCCCCC3)cc12
: