Target
Acetylcholinesterase
Ligand
BDBM50053436
Substrate
Meas. Tech.
ChEMBL_1460146 (CHEMBL3369131)
IC50
51±n/a nM
Citation
 Darras, FHWehle, SHuang, GSotriffer, CADecker, M Amine substitution of quinazolinones leads to selective nanomolar AChE inhibitors with 'inverted' binding mode. Bioorg Med Chem 22:4867-81 (2014)  
Target
Name:
Acetylcholinesterase
Synonyms:
ACES_ELEEL Acetylcholinesterase (EeAChE) | ache
Type:
Enzyme
Mol. Mass.:
71812.79
Organism:
Electrophorus electricus (Electric eel)
Description:
Residue:
633
  
Inhibitor
Name:
BDBM50053436
Synonyms:
CHEMBL3323068
Type:
Small organic molecule
Emp. Form.:
C20H29N3O2
Mol. Mass.:
343.4632
SMILES:
CCN(CC)CCCOc1ccc2nc3CCCCCn3c(=O)c2c1
: