Target
Acetylcholinesterase
Ligand
BDBM50053443
Substrate
Meas. Tech.
ChEMBL_1460146 (CHEMBL3369131)
IC50
72±n/a nM
Citation
 Darras, FHWehle, SHuang, GSotriffer, CADecker, M Amine substitution of quinazolinones leads to selective nanomolar AChE inhibitors with 'inverted' binding mode. Bioorg Med Chem 22:4867-81 (2014)  
Target
Name:
Acetylcholinesterase
Synonyms:
ACES_ELEEL Acetylcholinesterase (EeAChE) | ache
Type:
Enzyme
Mol. Mass.:
71812.79
Organism:
Electrophorus electricus (Electric eel)
Description:
Residue:
633
  
Inhibitor
Name:
BDBM50053443
Synonyms:
CHEMBL3323049
Type:
Small organic molecule
Emp. Form.:
C24H29N3O2
Mol. Mass.:
391.506
SMILES:
CCN(CC)CCCOc1ccc2nc3-c4ccccc4CCCn3c(=O)c2c1
: