Target
Acetylcholinesterase
Ligand
BDBM50053446
Substrate
Meas. Tech.
ChEMBL_1460146 (CHEMBL3369131)
IC50
50±n/a nM
Citation
 Darras, FHWehle, SHuang, GSotriffer, CADecker, M Amine substitution of quinazolinones leads to selective nanomolar AChE inhibitors with 'inverted' binding mode. Bioorg Med Chem 22:4867-81 (2014)  
Target
Name:
Acetylcholinesterase
Synonyms:
ACES_ELEEL Acetylcholinesterase (EeAChE) | ache
Type:
Enzyme
Mol. Mass.:
71812.79
Organism:
Electrophorus electricus (Electric eel)
Description:
Residue:
633
  
Inhibitor
Name:
BDBM50053446
Synonyms:
CHEMBL3323055
Type:
Small organic molecule
Emp. Form.:
C18H23N3O2
Mol. Mass.:
313.3941
SMILES:
O=c1n2CCCc2nc2ccc(OCCCN3CCCC3)cc12
: