Target
Hexokinase-4
Ligand
BDBM50053974
Substrate
Meas. Tech.
ChEMBL_1455572 (CHEMBL3364949)
IC50
20±n/a nM
Citation
 Hong, FTNorman, MHAshton, KSBartberger, MDChen, JChmait, SCupples, RFotsch, CJordan, SRLloyd, DJSivits, GTadesse, SHale, CSt Jean, DJ Small molecule disruptors of the glucokinase-glucokinase regulatory protein interaction: 4. Exploration of a novel binding pocket. J Med Chem 57:5949-64 (2014)  
Target
Name:
Hexokinase-4
Synonyms:
GCK Glucokinase (GK) HK IV HXK4_HUMAN Hexokinase-D
Type:
Enzyme
Mol. Mass.:
52175.81
Organism:
Homo sapiens (Human)
Description:
P35557
Residue:
465
  
Inhibitor
Name:
BDBM50053974
Synonyms:
CHEMBL3319558
Type:
Small organic molecule
Emp. Form.:
C24H20F6N6O4S
Mol. Mass.:
602.509
SMILES:
Nc1ccc(cn1)S(=O)(=O)N1CCN(CC1)c1ncc(cc1-c1ccc2ocnc2c1)C(O)(C(F)(F)F)C(F)(F)F
: