Target
Hexokinase-4
Ligand
BDBM50054097
Substrate
Meas. Tech.
ChEMBL_1455572 (CHEMBL3364949)
IC50
5.0±n/a nM
Citation
 Hong, FTNorman, MHAshton, KSBartberger, MDChen, JChmait, SCupples, RFotsch, CJordan, SRLloyd, DJSivits, GTadesse, SHale, CSt Jean, DJ Small molecule disruptors of the glucokinase-glucokinase regulatory protein interaction: 4. Exploration of a novel binding pocket. J Med Chem 57:5949-64 (2014)  
Target
Name:
Hexokinase-4
Synonyms:
GCK Glucokinase (GK) HK IV HXK4_HUMAN Hexokinase-D
Type:
Enzyme
Mol. Mass.:
52175.81
Organism:
Homo sapiens (Human)
Description:
P35557
Residue:
465
  
Inhibitor
Name:
BDBM50054097
Synonyms:
CHEMBL3319540
Type:
Small organic molecule
Emp. Form.:
C22H21F6N5O3S2
Mol. Mass.:
581.554
SMILES:
Cc1csc(c1)-c1cc(cnc1N1CCN(CC1)S(=O)(=O)c1ccc(N)nc1)C(O)(C(F)(F)F)C(F)(F)F
: