Target
Oxoeicosanoid receptor 1
Ligand
BDBM50054793
Substrate
Meas. Tech.
ChEMBL_1453946 (CHEMBL3366297)
IC50
6.0±n/a nM
Citation
 Patel, PReddy, CNGore, VChourey, SYe, QOuedraogo, YPGravel, SPowell, WSRokach, J Two Potent OXE-R Antagonists: Assignment of Stereochemistry. ACS Med Chem Lett 5:815-9 (2014)  
Target
Name:
Oxoeicosanoid receptor 1
Synonyms:
5-oxo-ETE G-protein coupled receptor G-protein coupled receptor R527 GPR170 OXER1_HUMAN TG 1019 | TG1019
Type:
Enzyme Catalytic Domain
Mol. Mass.:
45833.20
Organism:
Homo sapiens (Human)
Description:
TG 1019 0 HUMAN::Q8TDS5
Residue:
423
  
Inhibitor
Name:
BDBM50054793
Synonyms:
CHEMBL3341972
Type:
Small organic molecule
Emp. Form.:
C21H28ClNO3
Mol. Mass.:
377.905
SMILES:
CCCCCCc1c(C(=O)C[C@H](C)CC(O)=O)c2cc(Cl)ccc2n1C
: