Target
Beta-1 adrenergic receptor
Ligand
BDBM50055250
Substrate
Meas. Tech.
ChEMBL_1449715 (CHEMBL3378138)
Ki
66.0±n/a nM
Citation
 Arnold, NBeattie, DBradley, MBrearley, ABrown, LCharlton, SJFairhurst, RAFarr, DFozard, JFullerton, JGosling, MHatto, JJanus, DJones, DJordan, LLewis, CMaas, JMcCarthy, CMercer, MOakman, HPress, NProfit, RSchuerch, FSykes, DTaylor, RJTrifilieff, ATuffnell, A The identification of 7-[(R)-2-((1S,2S)-2-benzyloxycyclopentylamino)-1-hydroxyethyl]-4-hydroxybenzothiazolone as an inhaled long-actingß2-adrenoceptor agonist. Bioorg Med Chem Lett 24:4341-7 (2014)  
Target
Name:
Beta-1 adrenergic receptor
Synonyms:
ADRB1 ADRB1_HUMAN Beta-1 adrenoceptor | adrenergic Beta1
Type:
G Protein-Coupled Receptor (GPCR)
Mol. Mass.:
51338.40
Organism:
Homo sapiens (Human)
Description:
P08588
Residue:
477
  
Inhibitor
Name:
BDBM50055250
Synonyms:
CHEMBL3323653
Type:
Small organic molecule
Emp. Form.:
C19H26N2O3S
Mol. Mass.:
362.486
SMILES:
O[C@@H](CN[C@H]1CCC[C@H]1C1CCCC1)c1ccc(O)c2[nH]c(=O)sc12
: