Target
D(3) dopamine receptor
Ligand
BDBM50362867
Substrate
Meas. Tech.
ChEMBL_1452245 (CHEMBL3366157)
Ki
182±n/a nM
Citation
 Sampson, DBricker, BZhu, XYPeprah, KLamango, NSSetola, VRoth, BLAblordeppey, SY Further evaluation of the tropane analogs of haloperidol. Bioorg Med Chem Lett 24:4294-7 (2014)  
Target
Name:
D(3) dopamine receptor
Synonyms:
DOPAMINE D3 DRD3_HUMAN Dopamine D3 receptor (D3) Dopamine receptor Dopamine receptor D3
Type:
Mol. Mass.:
44243.43
Organism:
Homo sapiens (Human)
Description:
Residue:
400
  
Inhibitor
Name:
BDBM50362867
Synonyms:
CHEMBL1940403
Type:
Small organic molecule
Emp. Form.:
C20H23ClFNOS
Mol. Mass.:
379.919
SMILES:
OC1(CCN(CCCSc2ccc(F)cc2)CC1)c1ccc(Cl)cc1
: