Target
Cholinesterase
Ligand
BDBM50056106
Substrate
Meas. Tech.
ChEMBL_1447978 (CHEMBL3379804)
Ki
32±n/a nM
Citation
 Sun, QPeng, DYYang, SGZhu, XLYang, WCYang, GF Syntheses of coumarin-tacrine hybrids as dual-site acetylcholinesterase inhibitors and their activity against butylcholinesterase, Aß aggregation, andß-secretase. Bioorg Med Chem 22:4784-91 (2014)  
Target
Name:
Cholinesterase
Synonyms:
Acylcholine acylhydrolase Butyrylcholine esterase (BChE) Butyrylcholinesterase (BuChE) CHLE_HUMAN Cholinesterases Pseudocholinesterase
Type:
Homotetramer
Mol. Mass.:
68422.27
Organism:
Homo sapiens (Human)
Description:
P06276
Residue:
602
  
Inhibitor
Name:
BDBM50056106
Synonyms:
CHEMBL3326698
Type:
Small organic molecule
Emp. Form.:
C28H29N3O3
Mol. Mass.:
455.5482
SMILES:
O=C(NCCCCCNc1c2CCCCc2nc2ccccc12)c1cc2ccccc2oc1=O
: