Target
Cholinesterase
Ligand
BDBM50056122
Substrate
Meas. Tech.
ChEMBL_1447978 (CHEMBL3379804)
Ki
20±n/a nM
Citation
 Sun, QPeng, DYYang, SGZhu, XLYang, WCYang, GF Syntheses of coumarin-tacrine hybrids as dual-site acetylcholinesterase inhibitors and their activity against butylcholinesterase, Aß aggregation, andß-secretase. Bioorg Med Chem 22:4784-91 (2014)  
Target
Name:
Cholinesterase
Synonyms:
Acylcholine acylhydrolase Butyrylcholine esterase (BChE) Butyrylcholinesterase (BuChE) CHLE_HUMAN Cholinesterases Pseudocholinesterase
Type:
Homotetramer
Mol. Mass.:
68422.27
Organism:
Homo sapiens (Human)
Description:
P06276
Residue:
602
  
Inhibitor
Name:
BDBM50056122
Synonyms:
CHEMBL3326705
Type:
Small organic molecule
Emp. Form.:
C30H33N3O4
Mol. Mass.:
499.6007
SMILES:
COc1ccc2cc(C(=O)NCCCCCCNc3c4CCCCc4nc4ccccc34)c(=O)oc2c1
: