Target
Cholinesterase
Ligand
BDBM50056119
Substrate
Meas. Tech.
ChEMBL_1447978 (CHEMBL3379804)
Ki
20±n/a nM
Citation
 Sun, QPeng, DYYang, SGZhu, XLYang, WCYang, GF Syntheses of coumarin-tacrine hybrids as dual-site acetylcholinesterase inhibitors and their activity against butylcholinesterase, Aß aggregation, andß-secretase. Bioorg Med Chem 22:4784-91 (2014)  
Target
Name:
Cholinesterase
Synonyms:
Acylcholine acylhydrolase Butyrylcholine esterase (BChE) Butyrylcholinesterase (BuChE) CHLE_HUMAN Cholinesterases Pseudocholinesterase
Type:
Homotetramer
Mol. Mass.:
68422.27
Organism:
Homo sapiens (Human)
Description:
P06276
Residue:
602
  
Inhibitor
Name:
BDBM50056119
Synonyms:
CHEMBL3326710
Type:
Small organic molecule
Emp. Form.:
C30H33N3O3
Mol. Mass.:
483.6013
SMILES:
O=C(NCCCCCCCNc1c2CCCCc2nc2ccccc12)c1cc2ccccc2oc1=O
: