Target
Peptidyl-prolyl cis-trans isomerase NIMA-interacting 1
Ligand
BDBM50056210
Substrate
Meas. Tech.
ChEMBL_1449741 (CHEMBL3378164)
Ki
1000±n/a nM
Citation
 Guo, CHou, XDong, LMarakovits, JGreasley, SDagostino, EFerre, RJohnson, MCHumphries, PSLi, HPaderes, GDPiraino, JKraynov, EMurray, BW Structure-based design of novel human Pin1 inhibitors (III): optimizing affinity beyond the phosphate recognition pocket. Bioorg Med Chem Lett 24:4187-91 (2014)  
Target
Name:
Peptidyl-prolyl cis-trans isomerase NIMA-interacting 1
Synonyms:
PIN1 PPIase Pin1 | Peptidyl-prolyl cis-trans isomerase NIMA-interacting 1
Type:
PROTEIN
Mol. Mass.:
18248.11
Organism:
Homo sapiens (Human)
Description:
ChEMBL_1502595
Residue:
163
  
Inhibitor
Name:
BDBM50056210
Synonyms:
CHEMBL3322222
Type:
Small organic molecule
Emp. Form.:
C21H17N3O3
Mol. Mass.:
359.378
SMILES:
OC(=O)C(Cc1nc2ccccc2[nH]1)NC(=O)c1ccc2ccccc2c1
: