Target
Neuraminidase
Ligand
BDBM50241367
Substrate
Meas. Tech.
ChEMBL_1449776 (CHEMBL3378763)
IC50
62500±n/a nM
Citation
 Rakers, CSchwerdtfeger, SMMortier, JDuwe, SWolff, TWolber, GMelzig, MF Inhibitory potency of flavonoid derivatives on influenza virus neuraminidase. Bioorg Med Chem Lett 24:4312-7 (2014)  
Target
Name:
Neuraminidase
Synonyms:
NA Neuraminidase
Type:
PROTEIN
Mol. Mass.:
51863.92
Organism:
Influenza A virus (strain A/USSR/90/1977 H1N1)
Description:
ChEMBL_109720
Residue:
470
  
Inhibitor
Name:
BDBM50241367
Synonyms:
2-(3,4-Dihydroxy-phenyl)-5,7-dihydroxy-3-((2S,4R,5R)-3,4,5-trihydroxy-6-hydroxymethyl-tetrahydro-pyran-2-yloxy)-chromen-4-one quercetin 3-O-beta-D-glucopyranoside
Type:
Small organic molecule
Emp. Form.:
C21H20O12
Mol. Mass.:
464.3763
SMILES:
OC[C@H]1O[C@@H](Oc2c(O)c3c(cc(O)cc3=O)oc2-c2ccc(O)c(O)c2)[C@H](O)[C@@H](O)[C@H]1O
: