Target
Activin receptor type-1
Ligand
BDBM50056678
Substrate
Meas. Tech.
ChEMBL_1453217 (CHEMBL3365510)
IC50
110±n/a nM
Citation
 Mohedas, AHWang, YSanvitale, CECanning, PChoi, SXing, XBullock, ANCuny, GDYu, PB Structure-activity relationship of 3,5-diaryl-2-aminopyridine ALK2 inhibitors reveals unaltered binding affinity for fibrodysplasia ossificans progressiva causing mutants. J Med Chem 57:7900-15 (2014)  
Target
Name:
Activin receptor type-1
Synonyms:
2.7.11.30 ACVR1 ACVRLK2 ALK2/ACVR1 Activin receptor-like kinase 2 Activin receptor-like kinase 2 (ALK2/ACVR1) SKR1 TGF-B superfamily receptor type I | TSR-I
Type:
Mol. Mass.:
57158.32
Organism:
Homo sapiens (Human)
Description:
Residue:
509
  
Inhibitor
Name:
BDBM50056678
Synonyms:
CHEMBL3341792
Type:
Small organic molecule
Emp. Form.:
C24H23N5
Mol. Mass.:
381.4729
SMILES:
Nc1ncc(cc1-c1ccnc2ccccc12)-c1cccc(c1)N1CCNCC1
: