Target
Receptor-type tyrosine-protein kinase FLT3
Ligand
BDBM50056799
Substrate
Meas. Tech.
ChEMBL_1455839 (CHEMBL3361932)
IC50
46±n/a nM
Citation
 Yang, JSPark, CHLee, CKim, HOh, CChoi, YKang, JSYun, JJeong, JHKim, MHHan, G Synthesis and biological evaluation of novel thieno[2,3-d]pyrimidine-based FLT3 inhibitors as anti-leukemic agents. Eur J Med Chem 85:399-407 (2014)  
Target
Name:
Receptor-type tyrosine-protein kinase FLT3
Synonyms:
CD135 FL cytokine receptor FLK2 FLT3 Fetal liver kinase-2 Fms-like tyrosine kinase 3 (Flt-3) STK-1 Stem cell tyrosine kinase 1
Type:
Enzyme
Mol. Mass.:
112888.62
Organism:
Homo sapiens (Human)
Description:
P36888
Residue:
993
  
Inhibitor
Name:
BDBM50056799
Synonyms:
CHEMBL3326029
Type:
Small organic molecule
Emp. Form.:
C17H14N4O3S2
Mol. Mass.:
386.448
SMILES:
COc1sc2nc(nc(NN3C(=O)C=C(C)C3=O)c2c1C)-c1cccs1
: