Target
P2Y purinoceptor 12
Ligand
BDBM50057326
Substrate
Meas. Tech.
ChEMBL_1459507 (CHEMBL3369059)
IC50
39.0±n/a nM
Citation
 Caroff, EMeyer, ETreiber, AHilpert, KRiederer, MA Optimization of 2-phenyl-pyrimidine-4-carboxamides towards potent, orally bioavailable and selective P2Y(12) antagonists for inhibition of platelet aggregation. Bioorg Med Chem Lett 24:4323-31 (2014)  
Target
Name:
P2Y purinoceptor 12
Synonyms:
ADP-glucose receptor HORK3 P2T(AC) P2Y(AC) P2Y(cyc) P2Y12 platelet ADP receptor Purinergic receptor P2Y12 | SP1999
Type:
Enzyme
Mol. Mass.:
39458.48
Organism:
Homo sapiens (Human)
Description:
Q9H244
Residue:
342
  
Inhibitor
Name:
BDBM50057326
Synonyms:
CHEMBL3322650
Type:
Small organic molecule
Emp. Form.:
C28H35N5O7
Mol. Mass.:
553.6068
SMILES:
CCOC(=O)N1CCN(CC1)C(=O)[C@H](CCC(O)=O)NC(=O)c1cc(nc(n1)-c1ccccc1)[C@H]1C[C@@H]1COC
: