Target
Androgen receptor
Ligand
BDBM50410541
Substrate
Meas. Tech.
ChEMBL_1448074 (CHEMBL3371979)
EC50
0.130000±n/a nM
Citation
 Ullrich, TSasmal, SBoorgu, VPasagadi, SCheera, SRajagopalan, SBhumireddy, AShashikumar, DChelur, SBelliappa, CPandit, CKrishnamurthy, NMukherjee, SRamanathan, AGhadiyaram, CRamachandra, MSantos, PGLagu, BBock, MGPerrone, MHWeiler, SKeller, H 3-alkoxy-pyrrolo[1,2-b]pyrazolines as selective androgen receptor modulators with ideal physicochemical properties for transdermal administration. J Med Chem 57:7396-411 (2014)  
Target
Name:
Androgen receptor
Synonyms:
ANDR_HUMAN Androgen Receptor Androgen receptor/Baculoviral IAP repeat-containing protein 2 Dihydrotestosterone receptor Nuclear receptor subfamily 3 group C member 4
Type:
Receptor
Mol. Mass.:
99185.27
Organism:
Homo sapiens (Human)
Description:
CHO cells were stably transfected with human AR gene.
Residue:
920
  
Inhibitor
Name:
BDBM50410541
Synonyms:
CHEMBL194467
Type:
Small organic molecule
Emp. Form.:
C19H30O2
Mol. Mass.:
290.4403
SMILES:
C[C@]12CC[C@H]3[C@@H](CC[C@H]4CC(=O)CC[C@]34C)[C@@H]1CC[C@H]2O
: