Target
Phosphomannomutase 2
Ligand
BDBM34340
Substrate
Meas. Tech.
ChEMBL_1448920 (CHEMBL3375687)
IC50
11000±n/a nM
Citation
 Bravo, YTeriete, PDhanya, RPDahl, RLee, PSKiffer-Moreira, TGanji, SRSergienko, ESmith, LHFarquharson, CMillán, JLCosford, ND Design, synthesis and evaluation of benzoisothiazolones as selective inhibitors of PHOSPHO1. Bioorg Med Chem Lett 24:4308-11 (2014)  
Target
Name:
Phosphomannomutase 2
Synonyms:
PMM2 | PMM2_HUMAN
Type:
Enzyme Catalytic Domain
Mol. Mass.:
28082.33
Organism:
Homo sapiens (Human)
Description:
gi_4557839
Residue:
246
  
Inhibitor
Name:
BDBM34340
Synonyms:
2-(4-methyl-3-piperidin-1-ylsulfonyl-phenyl)-1,2-benzothiazol-3-one 2-(4-methyl-3-piperidinosulfonyl-phenyl)-1,2-benzothiazol-3-one MLS000057572 cid_2327953
Type:
Small organic molecule
Emp. Form.:
C19H20N2O3S2
Mol. Mass.:
388.504
SMILES:
Cc1ccc(cc1S(=O)(=O)N1CCCCC1)-n1sc2ccccc2c1=O
: