Target
5-hydroxytryptamine receptor 6
Ligand
BDBM50058214
Substrate
Meas. Tech.
ChEMBL_1453284 (CHEMBL3366233)
Ki
1517±n/a nM
Citation
 Kim, YTae, JLee, KRhim, HChoo, IHCho, HPark, WKKeum, GChoo, H Novel N-biphenyl-2-ylmethyl 2-methoxyphenylpiperazinylalkanamides as 5-HT7R antagonists for the treatment of depression. Bioorg Med Chem 22:4587-96 (2014)  
Target
Name:
5-hydroxytryptamine receptor 6
Synonyms:
5-HT-6 5-hydroxytryptamine receptor 6 (5-HT-6) 5-hydroxytryptamine receptor 6 (5HT6) HTR6 Serotonin 6 (5-HT6) receptor | Serotonin Receptor 6
Type:
G Protein-Coupled Receptor (GPCR)
Mol. Mass.:
46968.43
Organism:
Homo sapiens (Human)
Description:
P50406
Residue:
440
  
Inhibitor
Name:
BDBM50058214
Synonyms:
CHEMBL3326982
Type:
Small organic molecule
Emp. Form.:
C29H34ClN3O2
Mol. Mass.:
492.052
SMILES:
COc1ccccc1N1CCN(CCCCC(=O)NCc2ccccc2-c2ccccc2Cl)CC1
: