Target
Cannabinoid receptor 1
Ligand
BDBM50058506
Substrate
Meas. Tech.
ChEMBL_1459579 (CHEMBL3369614)
Ki
3798±n/a nM
Citation
 Pinna, GCurzu, MMDore, ALazzari, PRuiu, SPau, AMurineddu, GPinna, GA Tricyclic pyrazoles part 7. Discovery of potent and selective dihydrothienocyclopentapyrazole derived CB2 ligands. Eur J Med Chem 85:747-57 (2014)  
Target
Name:
Cannabinoid receptor 1
Synonyms:
Brain-type cannabinoid receptor CB-R CNR1_MOUSE Cannabinoid receptor | Cnr1
Type:
Enzyme
Mol. Mass.:
52842.52
Organism:
Mus musculus (Mouse)
Description:
P47746
Residue:
473
  
Inhibitor
Name:
BDBM50058506
Synonyms:
CHEMBL3331458
Type:
Small organic molecule
Emp. Form.:
C22H22Cl2N4OS
Mol. Mass.:
461.407
SMILES:
Cc1csc2Cc3c(nn(c3-c12)-c1ccc(Cl)cc1Cl)C(=O)NN1CCCCCC1
: