Target
Inosine-5'-monophosphate dehydrogenase
Ligand
BDBM50100894
Substrate
Meas. Tech.
ChEMBL_1452430 (CHEMBL3362092)
IC50
190±n/a nM
Citation
 Mandapati, KGorla, SKHouse, ALMcKenney, ESZhang, MRao, SNGollapalli, DRMann, BJGoldberg, JBCuny, GDGlomski, IJHedstrom, L Repurposing cryptosporidium inosine 5'-monophosphate dehydrogenase inhibitors as potential antibacterial agents. ACS Med Chem Lett 5:846-50 (2014)  
Target
Name:
Inosine-5'-monophosphate dehydrogenase
Synonyms:
Cgd6_20 protein Inosine-5'-monophosphate dehydrogenase, probable | Inosine-5-monophosphate dehydrogenase (IMPDH)
Type:
Protein
Mol. Mass.:
43076.80
Organism:
Cryptosporidium parvum
Description:
Q8T6T2
Residue:
400
  
Inhibitor
Name:
BDBM50100894
Synonyms:
CHEMBL3329561
Type:
Small organic molecule
Emp. Form.:
C18H19Cl2N3O2
Mol. Mass.:
380.268
SMILES:
C\C(=N/O)c1cccc(c1)C(C)(C)NC(=O)Nc1ccc(Cl)c(Cl)c1
: