Target
Inosine-5'-monophosphate dehydrogenase
Ligand
BDBM50432791
Substrate
Meas. Tech.
ChEMBL_1452433 (CHEMBL3362457)
Ki
64±n/a nM
Citation
 Mandapati, KGorla, SKHouse, ALMcKenney, ESZhang, MRao, SNGollapalli, DRMann, BJGoldberg, JBCuny, GDGlomski, IJHedstrom, L Repurposing cryptosporidium inosine 5'-monophosphate dehydrogenase inhibitors as potential antibacterial agents. ACS Med Chem Lett 5:846-50 (2014)  
Target
Name:
Inosine-5'-monophosphate dehydrogenase
Synonyms:
Cgd6_20 protein Inosine-5'-monophosphate dehydrogenase, probable | Inosine-5-monophosphate dehydrogenase (IMPDH)
Type:
Protein
Mol. Mass.:
43076.80
Organism:
Cryptosporidium parvum
Description:
Q8T6T2
Residue:
400
  
Inhibitor
Name:
BDBM50432791
Synonyms:
CHEMBL2348823
Type:
Small organic molecule
Emp. Form.:
C25H19N3O3
Mol. Mass.:
409.4367
SMILES:
C[C@H](Oc1cccc2ccccc12)C(=O)Nc1ccc2oc(nc2c1)-c1ccncc1
: