Target
Inosine-5'-monophosphate dehydrogenase
Ligand
BDBM50426014
Substrate
Meas. Tech.
ChEMBL_1452448 (CHEMBL3362472)
Ki
500±n/a nM
Citation
 Mandapati, KGorla, SKHouse, ALMcKenney, ESZhang, MRao, SNGollapalli, DRMann, BJGoldberg, JBCuny, GDGlomski, IJHedstrom, L Repurposing cryptosporidium inosine 5'-monophosphate dehydrogenase inhibitors as potential antibacterial agents. ACS Med Chem Lett 5:846-50 (2014)  
Target
Name:
Inosine-5'-monophosphate dehydrogenase
Synonyms:
AB164_07585 AB166_11280 AB168_06335 AB170_00090 AB893_00065 ADT20_14595 BF27_2004 | guaB
Type:
PROTEIN
Mol. Mass.:
52375.32
Organism:
Bacillus anthracis
Description:
ChEMBL_109471
Residue:
487
  
Inhibitor
Name:
BDBM50426014
Synonyms:
CHEMBL2315283
Type:
Small organic molecule
Emp. Form.:
C23H21N3O3
Mol. Mass.:
387.4311
SMILES:
Cn1nc(CC(=O)Nc2ccc3oc4CCCCc4c3c2)c2ccccc2c1=O
: