Target
Inosine-5'-monophosphate dehydrogenase
Ligand
BDBM50100981
Substrate
Meas. Tech.
ChEMBL_1452429 (CHEMBL3362091)
IC50
2.0±n/a nM
Citation
 Mandapati, KGorla, SKHouse, ALMcKenney, ESZhang, MRao, SNGollapalli, DRMann, BJGoldberg, JBCuny, GDGlomski, IJHedstrom, L Repurposing cryptosporidium inosine 5'-monophosphate dehydrogenase inhibitors as potential antibacterial agents. ACS Med Chem Lett 5:846-50 (2014)  
Target
Name:
Inosine-5'-monophosphate dehydrogenase
Synonyms:
AB164_07585 AB166_11280 AB168_06335 AB170_00090 AB893_00065 ADT20_14595 BF27_2004 | guaB
Type:
PROTEIN
Mol. Mass.:
52375.32
Organism:
Bacillus anthracis
Description:
ChEMBL_109471
Residue:
487
  
Inhibitor
Name:
BDBM50100981
Synonyms:
CHEMBL2178644
Type:
Small organic molecule
Emp. Form.:
C19H19ClF3N3O2
Mol. Mass.:
413.821
SMILES:
C\C(=N/O)c1cccc(c1)C(C)(C)NC(=O)Nc1ccc(Cl)c(c1)C(F)(F)F
: