Target
Adiponectin receptor protein 2
Ligand
BDBM50059083
Substrate
Meas. Tech.
ChEMBL_1461018 (CHEMBL3395076)
Kd
3100±n/a nM
Citation
 Rana, SBlowers, ECNatarajan, A Small molecule adenosine 5'-monophosphate activated protein kinase (AMPK) modulators and human diseases. J Med Chem 58:2-29 (2015)  
Target
Name:
Adiponectin receptor protein 2
Synonyms:
ADIPOR2 PAQR2 Progestin and adipoQ receptor family member II
Type:
PROTEIN
Mol. Mass.:
43884.36
Organism:
Homo sapiens (Human)
Description:
ChEMBL_109559
Residue:
386
  
Inhibitor
Name:
BDBM50059083
Synonyms:
CHEMBL3393145
Type:
Small organic molecule
Emp. Form.:
C27H28N2O3
Mol. Mass.:
428.5228
SMILES:
O=C(COc1ccc(cc1)C(=O)c1ccccc1)NC1CCN(Cc2ccccc2)CC1
: