Target
Aurora kinase A
Ligand
BDBM50059435
Substrate
Meas. Tech.
ChEMBL_1460905 (CHEMBL3396725)
IC50
0.600000±n/a nM
Target
Name:
Aurora kinase A
Synonyms:
AIK ARK1 AURKA AYK1 Aurora kinase A (AURA) Aurora kinase A (Aurora A) Aurora-related kinase 1 BTAK Breast-tumor-amplified kinase STK15 Serine/threonine kinase 15 Serine/threonine-protein kinase aurora A hARK1
Type:
Serine/threonine-protein kinase
Mol. Mass.:
45830.98
Organism:
Homo sapiens (Human)
Description:
O14965
Residue:
403
  
Inhibitor
Name:
BDBM50059435
Synonyms:
CHEMBL3393498
Type:
Small organic molecule
Emp. Form.:
C27H24N4O4
Mol. Mass.:
468.5039
SMILES:
CCOC(=O)c1[nH]cc2[C@@H](C3=C(CCCC3=O)Nc12)c1cccc(Oc2nc3ccccc3[nH]2)c1
: