Target
Leucine-rich repeat serine/threonine-protein kinase 2
Ligand
BDBM50059659
Substrate
Meas. Tech.
ChEMBL_1460931 (CHEMBL3396751)
IC50
99±n/a nM
Citation
 Koch, PGehringer, MLaufer, SA Inhibitors of c-Jun N-terminal kinases: an update. J Med Chem 58:72-95 (2015)  
Target
Name:
Leucine-rich repeat serine/threonine-protein kinase 2
Synonyms:
Dardarin LRRK2_HUMAN Leucine-rich repeat serine/threonine-protein kinase 2 PARK8
Type:
Protein
Mol. Mass.:
286113.20
Organism:
Homo sapiens (Human)
Description:
Q5S007
Residue:
2527
  
Inhibitor
Name:
BDBM50059659
Synonyms:
CHEMBL3393604
Type:
Small organic molecule
Emp. Form.:
C37H44N6O7
Mol. Mass.:
684.7813
SMILES:
COc1ccc2OC(COc2c1)C(=O)NC(=O)N(CC(C)C)CC(=O)NCCCCCCNC(=O)c1ccc(cc1)-c1n[nH]c2ccccc12
: