Target
D(2) dopamine receptor
Ligand
BDBM50016017
Substrate
Meas. Tech.
ChEMBL_1461354 (CHEMBL3396204)
EC50
45±n/a nM
Citation
 Jörg, MMay, LTMak, FSLee, KCMiller, NDScammells, PJCapuano, B Synthesis and pharmacological evaluation of dual acting ligands targeting the adenosine A2A and dopamine D2 receptors for the potential treatment of Parkinson's disease. J Med Chem 58:718-38 (2015)  
Target
Name:
D(2) dopamine receptor
Synonyms:
D(2) dopamine receptor DOPAMINE D2 Long DRD2 Dopamine D2 receptor Dopamine D2 receptor (D2R) Dopamine2-like | d2
Type:
Cell-surface receptors
Mol. Mass.:
50647.10
Organism:
Homo sapiens (Human)
Description:
P14416
Residue:
443
  
Inhibitor
Name:
BDBM50016017
Synonyms:
(5aR,9aR)-6-Propyl-5,5a,6,7,8,9,9a,10-octahydro-pyrido[2,3-g]quinazolin-2-ylamine 6-Propyl-5,5a,6,7,8,9,9a,10-octahydro-pyrido[2,3-g]quinazolin-2-ylamine(Quinelorane) Quinelorane | Quinerolane
Type:
Small organic molecule
Emp. Form.:
C14H22N4
Mol. Mass.:
246.3513
SMILES:
CCCN1CCC[C@@H]2Cc3nc(N)ncc3C[C@@H]12
: