Target
Nitric oxide synthase, brain
Ligand
BDBM50427863
Substrate
Meas. Tech.
ChEMBL_1461627 (CHEMBL3395012)
Ki
53±n/a nM
Citation
 Holden, JKKang, SHollingsworth, SALi, HLim, NChen, SHuang, HXue, FTang, WSilverman, RBPoulos, TL Structure-based design of bacterial nitric oxide synthase inhibitors. J Med Chem 58:994-1004 (2015)  
Target
Name:
Nitric oxide synthase, brain
Synonyms:
Bnos NC-NOS NOS type I nNOS Neuronal nitric oxide synthase Nitric Oxide Synthase, brain Nitric oxide synthase, brain (nNOS) Nitric-oxide synthase, brain (nNOS) Nos1 | Peptidyl-cysteine S-nitrosylase NOS1
Type:
Enzyme
Mol. Mass.:
160570.98
Organism:
Rattus norvegicus (rat)
Description:
Recombinant nNOS overexpressed in E. coli was used in enzyme assays.
Residue:
1429
  
Inhibitor
Name:
BDBM50427863
Synonyms:
CHEMBL2326360
Type:
Small organic molecule
Emp. Form.:
C23H29N5
Mol. Mass.:
375.5099
SMILES:
Cc1cc(N)nc(CCc2cc(CN)cc(CCc3cc(C)cc(N)n3)c2)c1
: