Target
Histamine H4 receptor
Ligand
BDBM50061017
Substrate
Meas. Tech.
ChEMBL_1461283 (CHEMBL3396057)
Ki
0.800000±n/a nM
Citation
 Savall, BMMeduna, SPTays, KCai, HThurmond, RLMcGovern, PGaul, MZhao, BPEdwards, JP Diaminopyrimidines, diaminopyridines and diaminopyridazines as histamine H4 receptor modulators. Bioorg Med Chem Lett 25:956-9 (2015)  
Target
Name:
Histamine H4 receptor
Synonyms:
AXOR35 GPCR105 HH4R HRH4 Histamine H4 receptor Histamine receptor (H3 and H4) SP9144
Type:
G Protein-Coupled Receptor (GPCR)
Mol. Mass.:
44517.02
Organism:
Homo sapiens (Human)
Description:
Binding assays were using CHO cells stably expressing hH4R receptors.
Residue:
390
  
Inhibitor
Name:
BDBM50061017
Synonyms:
CHEMBL3393547
Type:
Small organic molecule
Emp. Form.:
C16H25N5
Mol. Mass.:
287.4032
SMILES:
CN[C@@H]1CCN(C1)c1ccnc(NC2CC3CCC2C3)n1
: