Target
Beta-secretase 1
Ligand
BDBM50061593
Substrate
Meas. Tech.
ChEMBL_1461646 (CHEMBL3395115)
IC50
0.900000±n/a nM
Citation
 Chen, JJLiu, QYuan, CGore, VLopez, PMa, VAmegadzie, AQian, WJudd, TCMinatti, AEBrown, JCheng, YXue, MZhong, WDineen, TAEpstein, OHuman, JKreiman, CMarx, IWeiss, MMHitchcock, SAPowers, TSChen, KWen, PHWhittington, DACheng, ACBartberger, MDHickman, DWerner, JAVargas, HMEverds, NEVonderfecht, SLDunn, RTWood, SFremeau, RTWhite, RDPatel, VF Development of 2-aminooxazoline 3-azaxanthenes as orally efficaciousß-secretase inhibitors for the potential treatment of Alzheimer's disease. Bioorg Med Chem Lett 25:767-74 (2015)  
Target
Name:
Beta-secretase 1
Synonyms:
ASP2 Aspartyl protease 2 BACE1 Beta-secretase (BACE) Beta-secretase 1 (BACE 1) Beta-secretase 1 (BACE1) Beta-site amyloid precursor protein cleaving enzyme 1 Memapsin-2 beta-Secretase (BACE-1) | beta-Secretase (BACE1)
Type:
Protein
Mol. Mass.:
55755.10
Organism:
Homo sapiens (Human)
Description:
P56817
Residue:
501
  
Inhibitor
Name:
BDBM50061593
Synonyms:
CHEMBL3394040
Type:
Small organic molecule
Emp. Form.:
C26H23FN4O3
Mol. Mass.:
458.4842
SMILES:
CC1(C)OCCC(=C1)c1cc2c(Oc3ccc(cc3[C@@]22COC(N)=N2)-c2cccnc2F)cn1
: