Target
Potassium voltage-gated channel subfamily H member 2
Ligand
BDBM50061589
Substrate
Meas. Tech.
ChEMBL_1461648 (CHEMBL3395117)
Ki
>10000±n/a nM
Citation
 Chen, JJLiu, QYuan, CGore, VLopez, PMa, VAmegadzie, AQian, WJudd, TCMinatti, AEBrown, JCheng, YXue, MZhong, WDineen, TAEpstein, OHuman, JKreiman, CMarx, IWeiss, MMHitchcock, SAPowers, TSChen, KWen, PHWhittington, DACheng, ACBartberger, MDHickman, DWerner, JAVargas, HMEverds, NEVonderfecht, SLDunn, RTWood, SFremeau, RTWhite, RDPatel, VF Development of 2-aminooxazoline 3-azaxanthenes as orally efficaciousß-secretase inhibitors for the potential treatment of Alzheimer's disease. Bioorg Med Chem Lett 25:767-74 (2015)  
Target
Name:
Potassium voltage-gated channel subfamily H member 2
Synonyms:
1,3-beta-glucan synthase component GLS2 ERG Eag-related protein 1 Ether-a-go-go-related gene (HERG) Ether-a-go-go-related gene potassium channel 1 Ether-a-go-go-related gene potassium channel 1 (hERG1) Ether-a-go-go-related protein 1 H-ERG KCNH2 Potassium voltage-gated channel subfamily H member 2 (hERG) Voltage-gated potassium channel subunit Kv11.1 hERG Potassium Channel 1 | putative potassium channel subunit
Type:
Multi-pass membrane protein
Mol. Mass.:
126672.65
Organism:
Homo sapiens (Human)
Description:
Q12809
Residue:
1159
  
Inhibitor
Name:
BDBM50061589
Synonyms:
CHEMBL3394053
Type:
Small organic molecule
Emp. Form.:
C24H16FN5O2
Mol. Mass.:
425.4145
SMILES:
NC1=N[C@@]2(CO1)c1cc(ccc1Oc1cnc(cc21)-c1ccccn1)-c1cccnc1F
: