Target
Proto-oncogene tyrosine-protein kinase ROS
Ligand
BDBM50399540
Substrate
Meas. Tech.
ChEMBL_1462711 (CHEMBL3399439)
IC50
10.0±n/a nM
Citation
 Abdelazem, AZAl-Sanea, MMPark, BSPark, HMYoo, KHSim, TPark, JBLee, SHLee, SH Synthesis and biological evaluation of new pyrazol-4-ylpyrimidine derivatives as potential ROS1 kinase inhibitors. Eur J Med Chem 90:195-208 (2015)  
Target
Name:
Proto-oncogene tyrosine-protein kinase ROS
Synonyms:
MCF3 Proto-oncogene c-Ros-1 ROS1 Receptor tyrosine kinase c-ros oncogene 1 c-Ros receptor tyrosine kinase
Type:
Enzyme
Mol. Mass.:
263897.39
Organism:
Homo sapiens (Human)
Description:
P08922
Residue:
2347
  
Inhibitor
Name:
BDBM50399540
Synonyms:
FORETINIB US10882853, Compound For-Oxide
Type:
Small organic molecule
Emp. Form.:
C34H34F2N4O6
Mol. Mass.:
632.6538
SMILES:
COc1cc2c(Oc3ccc(NC(=O)C4(CC4)C(=O)Nc4ccc(F)cc4)cc3F)ccnc2cc1OCCCN1CCOCC1
: