Target
Sodium-dependent serotonin transporter
Ligand
BDBM50063504
Substrate
Meas. Tech.
ChEMBL_1463269 (CHEMBL3399458)
IC50
6607±n/a nM
Citation
 Steffan, TRenukappa-Gutke, THöfner, GWanner, KT Design, synthesis and SAR studies of GABA uptake inhibitors derived from 2-substituted pyrrolidine-2-yl-acetic acids. Bioorg Med Chem 23:1284-306 (2015)  
Target
Name:
Sodium-dependent serotonin transporter
Synonyms:
5-HT Transporter 5HTT SC6A4_MOUSE Sert Sodium-dependent serotonin transporter | Solute carrier family 6 member 4
Type:
Enzyme Catalytic Domain
Mol. Mass.:
70044.92
Organism:
MOUSE
Description:
5-HT Transporter SLC6A4 MOUSE::Q60857
Residue:
630
  
Inhibitor
Name:
BDBM50063504
Synonyms:
CHEMBL3398503
Type:
Small organic molecule
Emp. Form.:
C30H35NO7
Mol. Mass.:
521.6014
SMILES:
[H][C@@]1(CCCN1CCOC(c1ccc(OC)cc1)(c1ccc(OC)cc1)c1ccc(OC)cc1)[C@H](O)C(O)=O
: