Target
Sodium-dependent serotonin transporter
Ligand
BDBM50063507
Substrate
Meas. Tech.
ChEMBL_1463269 (CHEMBL3399458)
IC50
100000±n/a nM
Citation
 Steffan, TRenukappa-Gutke, THöfner, GWanner, KT Design, synthesis and SAR studies of GABA uptake inhibitors derived from 2-substituted pyrrolidine-2-yl-acetic acids. Bioorg Med Chem 23:1284-306 (2015)  
Target
Name:
Sodium-dependent serotonin transporter
Synonyms:
5-HT Transporter 5HTT SC6A4_MOUSE Sert Sodium-dependent serotonin transporter | Solute carrier family 6 member 4
Type:
Enzyme Catalytic Domain
Mol. Mass.:
70044.92
Organism:
MOUSE
Description:
5-HT Transporter SLC6A4 MOUSE::Q60857
Residue:
630
  
Inhibitor
Name:
BDBM50063507
Synonyms:
CHEMBL3398507
Type:
Small organic molecule
Emp. Form.:
C22H27F3N2O4S2
Mol. Mass.:
504.586
SMILES:
[#8]-[#6](=O)C(F)(F)F.[H][C@@]1([#6]-[#6]-[#6]-[#7]1-[#6]-[#6]\[#6]=[#6](/c1sccc1-[#6])-c1sccc1-[#6])[#6@H](-[#7])-[#6](-[#8])=O
: