Target
Sodium-dependent dopamine transporter
Ligand
BDBM50063499
Substrate
Meas. Tech.
ChEMBL_1463267 (CHEMBL3399456)
IC50
338844±n/a nM
Citation
 Steffan, TRenukappa-Gutke, THöfner, GWanner, KT Design, synthesis and SAR studies of GABA uptake inhibitors derived from 2-substituted pyrrolidine-2-yl-acetic acids. Bioorg Med Chem 23:1284-306 (2015)  
Target
Name:
Sodium-dependent dopamine transporter
Synonyms:
DA transporter Dat1 SC6A3_MOUSE Sodium-dependent dopamine transporter | Solute carrier family 6 member 3
Type:
Enzyme Catalytic Domain
Mol. Mass.:
68809.06
Organism:
MOUSE
Description:
Dopamine Transporter SLC6A3 MOUSE::Q61327
Residue:
619
  
Inhibitor
Name:
BDBM50063499
Synonyms:
(R)-Homoproline | CHEMBL1163348
Type:
Small organic molecule
Emp. Form.:
C6H11NO2
Mol. Mass.:
129.157
SMILES:
OC(=O)C[C@H]1CCCN1
: