Target
Histone-lysine N-methyltransferase 2A
Ligand
BDBM50009672
Substrate
Meas. Tech.
ChEMBL_1463675 (CHEMBL3399062)
IC50
2300±n/a nM
Citation
 Kung, PPHuang, BZehnder, LTatlock, JBingham, PKrivacic, CGajiwala, KDiehl, WYu, XMaegley, KA SAH derived potent and selective EZH2 inhibitors. Bioorg Med Chem Lett 25:1532-7 (2015)  
Target
Name:
Histone-lysine N-methyltransferase 2A
Synonyms:
ALL-1 ALL1 CXXC-type zinc finger protein 7 HRX Histone-lysine N-methyltransferase 2A KMT2A_HUMAN MLL MLL cleavage product N320 Myeloid/lymphoid or mixed-lineage leukemia Myeloid/lymphoid or mixed-lineage leukemia protein 1 TRX1 Zinc finger protein HRX p320
Type:
Protein
Mol. Mass.:
431905.67
Organism:
Homo sapiens (Human)
Description:
Q03164
Residue:
3969
  
Inhibitor
Name:
BDBM50009672
Synonyms:
AdoHcy S-(5'-adenosyl)-L-homocysteine S-[1-(adenin-9-yl)-1,5-dideoxy-beta-D-ribofuranos-5-yl]-L-homocysteine SAH US9175331, 1 | US9333217, S-Adenosyl-L-homocysteine (SAH)
Type:
Small organic molecule
Emp. Form.:
C14H20N6O5S
Mol. Mass.:
384.411
SMILES:
N[C@@H](CCSC[C@H]1O[C@H]([C@H](O)[C@@H]1O)n1cnc2c(N)ncnc12)C(O)=O
: